BDBM50464440 CHEMBL4294256
SMILES Cc1ccc(CN2CCN(CC2)S(=O)(=O)c2ccc(Br)cc2)cc1
InChI Key InChIKey=XXMBVLLXIHXZOP-UHFFFAOYSA-N
Data  1 IC50
  Tab Delimited (TSV)   2D SDfile   Computed 3D by Vconf -m prep SDfile
Find this compound or compounds like it in BindingDB:
Activity Spreadsheet -- Enzyme Inhibition Constant Data from BindingDB
Found 1 hit for monomerid = 50464440
TargetPancreatic alpha-amylase(Sus scrofa (Pig))
University Of Dammam
Curated by ChEMBL
LigandPNGBDBM50464440(CHEMBL4294256)
Affinity DataIC50:  2.12E+3nM. Assay description: Inhibition of porcine pancreatic alpha-amylase using starch as substrate preincubated for 10 mins followed by substrate addition measured after 10 mi...
Ligand InfoPC cidPC sid
In DepthDetails ArticlePubMed